{"text_format":"1","workbook":"xlsx","n_sheets":3,"sheets":["Original Data Set","Give it a Try Here","Pics"],"not_rendered":{"charts":1,"images":4,"macros":1,"external_links":0,"defined_names":6,"comments":0,"pivot_tables":0},"unopened":[],"bounds":{"document_bytes":16777216,"sheet_cells":100000,"rows_first":2000,"rows_last":500,"rows_between":2000,"halvings":0,"cell_chars":16384,"cell_head_chars":4096},"cells_cut":0,"cells_raw":0,"read":"whole","date_system":"1900"}

{"sheet":"Original Data Set","index":0,"n_rows":17,"n_cols":14,"rows_kept":17,"cut":false,"hidden":false,"merged":[]}
["PERSON","Year","Jan","Feb","Mar","Apr","May","June","July","Aug","Sept","Oct","Nov","Dec"]
["JOE",2010,31,44,42,41,44,34,44,26,34,36,37,37]
["LARRY",2010,27,21,24,39,25,33,34,47,35,29,35,39]
["PETE",2010,25,19,29,35,27,20,21,36,33,35,28,22]
["SAM",2010,5,2,5,6,4,1,2,8,4,3,1,3]
["JOE",2011,43,37,62,46,43,47,35,31,49,28,35,34]
["LARRY",2011,22,35,38,35,37,26,30,35,28,34,36,30]
["PETE",2011,32,22,17,34,27,26,29,29,30,24,16,25]
["SAM",2011,9,2,9,2,7,2,6,5,3,5,0,1]
["JOE",2012,26,30,41,29,26,42,29,19,45,23,24,35]
["LARRY",2012,22,27,38,25,29,21,31,31,18,31,23,25]
["PETE",2012,24,20,20,17,25,20,25,28,22,31,17,9]
["SAM",2012,2,3,2,5,3,4,0,2,3,3,3,0]
["JOE",2013,43,43,35,36,20,30,41,23,29,26,1,1]
["LARRY",2013,28,26,27,17,24,32,30,31,14,36,29,29]
["PETE",2013,23,21,24,16,21,16,12,18,20,22,27,36]
["SAM",2013,3,0,6,1,5,4,4,2,2,3,0,4]

{"sheet":"Give it a Try Here","index":1,"n_rows":50,"n_cols":14,"rows_kept":50,"cut":false,"hidden":false,"merged":[]}
["Person","Year","Jan","Feb","Mar","Apr","May","June","July","Aug","Sept","Oct","Nov","Dec"]
["JOE",2010,31,44,42,41,44,34,44,26,34,36,37,37]
["LARRY",2010,27,21,24,39,25,33,34,47,35,29,35,39]
["PETE",2010,25,19,29,35,27,20,21,36,33,35,28,22]
["SAM",2010,5,2,5,6,4,1,2,8,4,3,1,3]
["JOE",2011,43,37,62,46,43,47,35,31,49,28,35,34]
["LARRY",2011,22,35,38,35,37,26,30,35,28,34,36,30]
["PETE",2011,32,22,17,34,27,26,29,29,30,24,16,25]
["SAM",2011,9,2,9,2,7,2,6,5,3,5,0,1]
["JOE",2012,26,30,41,29,26,42,29,19,45,23,24,35]
["LARRY",2012,22,27,38,25,29,21,31,31,18,31,23,25]
["PETE",2012,24,20,20,17,25,20,25,28,22,31,17,9]
["SAM",2012,2,3,2,5,3,4,0,2,3,3,3,0]
["JOE",2013,43,43,35,36,20,30,41,23,29,26,1,1]
["LARRY",2013,28,26,27,17,24,32,30,31,14,36,29,29]
["PETE",2013,23,21,24,16,21,16,12,18,20,22,27,36]
["SAM",2013,3,0,6,1,5,4,4,2,2,3,0,4]
[]
[]
["Person","Show"]
["JOE",true]
["LARRY",true]
["PETE",true]
["SAM",true]
[]
[]
["Year","Show"]
[2010,true]
[2011,true]
[2012,true]
[2013,true]
[]
["Friday Challenge - Multi Year Graph by Month"]
[null,null,"Jan","Feb","Mar","Apr","May","June","July","Aug","Sept","Oct","Nov","Dec"]
[{"$f":"IF(AND(B21,$B$28),A2,NA())","v":"JOE"},{"$f":"IF($B$28,$A$28,NA())","v":2010},{"$f":"IF(AND($B$21,$B$28),C2,NA())","v":31},{"$f":"IF(AND($B$21,$B$28),D2,NA())","v":44},42,41,44,34,44,26,34,36,37,37]
[{"$f":"IF(AND(B22,$B$28),A3,NA())","v":"LARRY"},{"$f":"IF($B$28,$A$28,NA())","v":2010},{"$f":"IF(AND($B$22,$B$28),C3,NA())","v":27},{"$f":"IF(AND($B$22,$B$28),D3,NA())","v":21},24,39,25,33,34,47,35,29,35,39]
["PETE",2010,{"$f":"IF(AND($B$23,$B$28),C4,NA())","v":25},{"$f":"IF(AND($B$23,$B$28),D4,NA())","v":19},29,35,27,20,21,36,33,35,28,22]
["SAM",2010,{"$f":"IF(AND($B$24,$B$28),C5,NA())","v":5},{"$f":"IF(AND($B$24,$B$28),D5,NA())","v":2},5,6,4,1,2,8,4,3,1,3]
[{"$f":"IF(AND(B21,$B$29),A6,NA())","v":"JOE"},{"$f":"IF($B$29,$A$29,NA())","v":2011},{"$f":"IF(AND($B$21,$B$29),C6,NA())","v":43},{"$f":"IF(AND($B$21,$B$29),D6,NA())","v":37},62,46,43,47,35,31,49,28,35,34]
[{"$f":"IF(AND(B22,$B$29),A7,NA())","v":"LARRY"},{"$f":"IF($B$29,$A$29,NA())","v":2011},{"$f":"IF(AND($B$22,$B$29),C7,NA())","v":22},{"$f":"IF(AND($B$22,$B$29),D7,NA())","v":35},38,35,37,26,30,35,28,34,36,30]
["PETE",2011,{"$f":"IF(AND($B$23,$B$29),C8,NA())","v":32},{"$f":"IF(AND($B$23,$B$29),D8,NA())","v":22},17,34,27,26,29,29,30,24,16,25]
["SAM",2011,{"$f":"IF(AND($B$24,$B$29),C9,NA())","v":9},{"$f":"IF(AND($B$24,$B$29),D9,NA())","v":2},9,2,7,2,6,5,3,5,0,1]
[{"$f":"IF(AND(B21,$B$30),A10,NA())","v":"JOE"},{"$f":"IF($B$30,$A$30,NA())","v":2012},{"$f":"IF(AND($B$21,$B$30),C10,NA())","v":26},{"$f":"IF(AND($B$21,$B$30),D10,NA())","v":30},41,29,26,42,29,19,45,23,24,35]
[{"$f":"IF(AND(B22,$B$30),A11,NA())","v":"LARRY"},{"$f":"IF($B$30,$A$30,NA())","v":2012},{"$f":"IF(AND($B$22,$B$30),C11,NA())","v":22},{"$f":"IF(AND($B$22,$B$30),D11,NA())","v":27},38,25,29,21,31,31,18,31,23,25]
["PETE",2012,{"$f":"IF(AND($B$23,$B$30),C12,NA())","v":24},{"$f":"IF(AND($B$23,$B$30),D12,NA())","v":20},20,17,25,20,25,28,22,31,17,9]
["SAM",2012,{"$f":"IF(AND($B$24,$B$30),C13,NA())","v":2},{"$f":"IF(AND($B$24,$B$30),D13,NA())","v":3},2,5,3,4,0,2,3,3,3,0]
[{"$f":"IF(AND(B21,$B$31),A14,NA())","v":"JOE"},{"$f":"IF($B$31,$A$31,NA())","v":2013},{"$f":"IF(AND($B$21,$B$31),C14,NA())","v":43},{"$f":"IF(AND($B$21,$B$31),D14,NA())","v":43},35,36,20,30,41,23,29,26,1,1]
[{"$f":"IF(AND(B22,$B$31),A15,NA())","v":"LARRY"},{"$f":"IF($B$31,$A$31,NA())","v":2013},{"$f":"IF(AND($B$22,$B$31),C15,NA())","v":28},{"$f":"IF(AND($B$22,$B$31),D15,NA())","v":26},27,17,24,32,30,31,14,36,29,29]
[{"$f":"IF(AND(B23,$B$31),A16,NA())","v":"PETE"},2013,{"$f":"IF(AND($B$23,$B$31),C16,NA())","v":23},{"$f":"IF(AND($B$23,$B$31),D16,NA())","v":21},24,16,21,16,12,18,20,22,27,36]
[{"$f":"IF(AND(B24,$B$31),A17,NA())","v":"SAM"},2013,{"$f":"IF(AND($B$24,$B$31),C17,NA())","v":3},{"$f":"IF(AND($B$24,$B$31),D17,NA())","v":0},6,1,5,4,4,2,2,3,0,4]

{"sheet":"Pics","index":2,"n_rows":5,"n_cols":2,"rows_kept":5,"cut":false,"hidden":true,"merged":[]}
["MyPicSelect",{"$f":"RANDBETWEEN(1,4)","v":3}]
[1]
[2,"Click here to visit\nwww.ExcelDashboardTemplates.com"]
[3]
[4,"Learn Excel at \nwww.ExcelDashboardTemplates.com"]