{"text_format":"1","workbook":"xlsx","n_sheets":3,"sheets":["Data","Calculations","Dashboard"],"not_rendered":{"charts":5,"images":0,"macros":0,"external_links":0,"defined_names":0,"comments":0,"pivot_tables":0},"unopened":[],"bounds":{"document_bytes":16777216,"sheet_cells":100000,"rows_first":2000,"rows_last":500,"rows_between":2000,"halvings":0,"cell_chars":16384,"cell_head_chars":4096},"cells_cut":0,"cells_raw":0,"read":"whole","date_system":"1900"}

{"sheet":"Data","index":0,"n_rows":40,"n_cols":14,"rows_kept":40,"cut":false,"hidden":false,"merged":[]}
[]
[]
[]
[]
[null,null,"Schedule Change Metric",null,null,null,"Reason codes"]
[null,null,"Week","schedules","changes","% change","Quality","Vendor","Attainment","Ops","Planning","Consumption","R&D","Sales"]
[null,null,1,42,4,9.5000000000000001E-2,1,1,1,1]
[null,null,2,58,7,0.121,null,null,2,4,1]
[null,null,3,61,3,4.9000000000000002E-2,null,3]
[null,null,4,56,9,0.161,1,2,1,2,null,null,3]
[null,null,5,57,14,0.246,null,3,null,7,1,null,null,3]
[null,null,6,55,10,0.182,null,5,null,4,null,null,1]
[null,null,7,51,3,5.8999999999999997E-2,null,1,null,2]
[null,null,8,52,2,3.7999999999999999E-2,null,null,null,2]
[null,null,9,58,10,0.17199999999999999,1,null,null,5,2,null,null,2]
[null,null,10,47,3,6.4000000000000001E-2,null,3]
[null,null,11,48,1,2.1000000000000001E-2,null,null,null,null,null,null,null,1]
[null,null,12,45,2,4.3999999999999997E-2,null,null,null,1,null,null,1]
[null,null,13,28,1,3.5999999999999997E-2,null,null,null,null,null,null,null,1]
[null,null,14,42,7,0.16700000000000001,null,3,null,null,1,null,null,3]
[null,null,15,44,0,0]
[null,null,16,41,1,2.4E-2,null,1]
[null,null,17,41,0,0]
[null,null,18,39,0,0]
[null,null,19,38,1,2.5999999999999999E-2,null,1]
[null,null,20,46,1,2.1999999999999999E-2,null,1]
[null,null,21,38,0,0]
[null,null,22,38,1,2.5999999999999999E-2,null,1]
[null,null,23,49,0,0]
[null,null,24,34,2,5.8999999999999997E-2,null,2]
[null,null,25,33,3,9.0999999999999998E-2,null,3]
[null,null,26,32,6,0.188,null,5,null,null,1]
[null,null,27,18,0,0]
[null,null,28,37,2,5.3999999999999999E-2,null,2]
[null,null,29,34,4,0.11799999999999999,null,null,null,4]
[null,null,30,32,0,0]
[null,null,31,31,1,3.2000000000000001E-2,null,null,null,1]
[null,null,32,33,5,0.152,null,null,null,5]
[null,null,33,33,1,0.03,null,null,1]
[null,null,"Totals",1391,104,7.4800000000000005E-2,3,37,5,38,6,0,5,10]

{"sheet":"Calculations","index":1,"n_rows":55,"n_cols":29,"rows_kept":55,"cut":false,"hidden":false,"merged":[]}
[]
[]
[]
[]
[null,null,{"$f":"IF(ISBLANK(Data!C5),\"\",Data!C5)","v":"Schedule Change Metric"},null,null,null,{"$f":"IF(ISBLANK(Data!G5),\"\",Data!G5)","v":"Reason codes"}]
[null,null,{"$f":"IF(ISBLANK(Data!C6),\"\",Data!C6)","v":"Week"},{"$f":"IF(ISBLANK(Data!D6),\"\",Data!D6)","v":"schedules"},{"$f":"IF(ISBLANK(Data!E6),\"\",Data!E6)","v":"changes"},{"$f":"IF(ISBLANK(Data!F6),\"\",Data!F6)","v":"% change"},{"$f":"IF(ISBLANK(Data!G6),\"\",Data!G6)","v":"Quality"},{"$f":"IF(ISBLANK(Data!H6),\"\",Data!H6)","v":"Vendor"},{"$f":"IF(ISBLANK(Data!I6),\"\",Data!I6)","v":"Attainment"},{"$f":"IF(ISBLANK(Data!J6),\"\",Data!J6)","v":"Ops"},{"$f":"IF(ISBLANK(Data!K6),\"\",Data!K6)","v":"Planning"},{"$f":"IF(ISBLANK(Data!L6),\"\",Data!L6)","v":"Consumption"},{"$f":"IF(ISBLANK(Data!M6),\"\",Data!M6)","v":"R&D"},{"$f":"IF(ISBLANK(Data!N6),\"\",Data!N6)","v":"Sales"},null,null,"Schedules","Changes",null,null,"Totals"]
[null,null,{"$f":"IF(ISBLANK(Data!C7),\"\",Data!C7)","v":1},{"$f":"IF(ISBLANK(Data!D7),\"\",Data!D7)","v":42},{"$f":"IF(ISBLANK(Data!E7),\"\",Data!E7)","v":4},{"$f":"IF(ISBLANK(Data!F7),\"\",Data!F7)","v":9.5000000000000001E-2},{"$f":"IF(ISBLANK(Data!G7),\"\",Data!G7)","v":1},{"$f":"IF(ISBLANK(Data!H7),\"\",Data!H7)","v":1},{"$f":"IF(ISBLANK(Data!I7),\"\",Data!I7)","v":1},{"$f":"IF(ISBLANK(Data!J7),\"\",Data!J7)","v":1},{"$f":"IF(ISBLANK(Data!K7),\"\",Data!K7)","v":""},{"$f":"IF(ISBLANK(Data!L7),\"\",Data!L7)","v":""},{"$f":"IF(ISBLANK(Data!M7),\"\",Data!M7)","v":""},{"$f":"IF(ISBLANK(Data!N7),\"\",Data!N7)","v":""},null,"Week",true,true,null,null,{"$f":"Calculations!G6","v":"Quality"},{"$f":"Calculations!H6","v":"Vendor"},{"$f":"Calculations!I6","v":"Attainment"},{"$f":"Calculations!J6","v":"Ops"},{"$f":"Calculations!K6","v":"Planning"},{"$f":"Calculations!L6","v":"Consumption"},{"$f":"Calculations!M6","v":"R&D"},{"$f":"Calculations!N6","v":"Sales"}]
[null,null,{"$f":"IF(ISBLANK(Data!C8),\"\",Data!C8)","v":2},{"$f":"IF(ISBLANK(Data!D8),\"\",Data!D8)","v":58},{"$f":"IF(ISBLANK(Data!E8),\"\",Data!E8)","v":7},{"$f":"IF(ISBLANK(Data!F8),\"\",Data!F8)","v":0.121},{"$f":"IF(ISBLANK(Data!G8),\"\",Data!G8)","v":""},{"$f":"IF(ISBLANK(Data!H8),\"\",Data!H8)","v":""},{"$f":"IF(ISBLANK(Data!I8),\"\",Data!I8)","v":2},{"$f":"IF(ISBLANK(Data!J8),\"\",Data!J8)","v":4},{"$f":"IF(ISBLANK(Data!K8),\"\",Data!K8)","v":1},{"$f":"IF(ISBLANK(Data!L8),\"\",Data!L8)","v":""},{"$f":"IF(ISBLANK(Data!M8),\"\",Data!M8)","v":""},{"$f":"IF(ISBLANK(Data!N8),\"\",Data!N8)","v":""},"Week",{"$f":"C7","v":1},{"$f":"IF($Q$7,D7,NA())","v":42},{"$f":"IF($R$7,E7,NA())","v":4},null,null,{"$f":"Calculations!G40","v":3},{"$f":"Calculations!H40","v":37},{"$f":"Calculations!I40","v":5},{"$f":"Calculations!J40","v":38},{"$f":"Calculations!K40","v":6},{"$f":"Calculations!L40","v":0},{"$f":"Calculations!M40","v":5},{"$f":"Calculations!N40","v":10}]
[null,null,{"$f":"IF(ISBLANK(Data!C9),\"\",Data!C9)","v":3},{"$f":"IF(ISBLANK(Data!D9),\"\",Data!D9)","v":61},{"$f":"IF(ISBLANK(Data!E9),\"\",Data!E9)","v":3},{"$f":"IF(ISBLANK(Data!F9),\"\",Data!F9)","v":4.9000000000000002E-2},{"$f":"IF(ISBLANK(Data!G9),\"\",Data!G9)","v":""},{"$f":"IF(ISBLANK(Data!H9),\"\",Data!H9)","v":3},{"$f":"IF(ISBLANK(Data!I9),\"\",Data!I9)","v":""},{"$f":"IF(ISBLANK(Data!J9),\"\",Data!J9)","v":""},{"$f":"IF(ISBLANK(Data!K9),\"\",Data!K9)","v":""},{"$f":"IF(ISBLANK(Data!L9),\"\",Data!L9)","v":""},{"$f":"IF(ISBLANK(Data!M9),\"\",Data!M9)","v":""},{"$f":"IF(ISBLANK(Data!N9),\"\",Data!N9)","v":""},null,{"$f":"C8","v":2},{"$f":"IF($Q$7,D8,NA())","v":58},{"$f":"IF($R$7,E8,NA())","v":7}]
[null,null,{"$f":"IF(ISBLANK(Data!C10),\"\",Data!C10)","v":4},{"$f":"IF(ISBLANK(Data!D10),\"\",Data!D10)","v":56},{"$f":"IF(ISBLANK(Data!E10),\"\",Data!E10)","v":9},{"$f":"IF(ISBLANK(Data!F10),\"\",Data!F10)","v":0.161},{"$f":"IF(ISBLANK(Data!G10),\"\",Data!G10)","v":1},{"$f":"IF(ISBLANK(Data!H10),\"\",Data!H10)","v":2},{"$f":"IF(ISBLANK(Data!I10),\"\",Data!I10)","v":1},{"$f":"IF(ISBLANK(Data!J10),\"\",Data!J10)","v":2},{"$f":"IF(ISBLANK(Data!K10),\"\",Data!K10)","v":""},{"$f":"IF(ISBLANK(Data!L10),\"\",Data!L10)","v":""},{"$f":"IF(ISBLANK(Data!M10),\"\",Data!M10)","v":3},{"$f":"IF(ISBLANK(Data!N10),\"\",Data!N10)","v":""},null,3,61,3]
[null,null,{"$f":"IF(ISBLANK(Data!C11),\"\",Data!C11)","v":5},{"$f":"IF(ISBLANK(Data!D11),\"\",Data!D11)","v":57},{"$f":"IF(ISBLANK(Data!E11),\"\",Data!E11)","v":14},{"$f":"IF(ISBLANK(Data!F11),\"\",Data!F11)","v":0.246},{"$f":"IF(ISBLANK(Data!G11),\"\",Data!G11)","v":""},{"$f":"IF(ISBLANK(Data!H11),\"\",Data!H11)","v":3},{"$f":"IF(ISBLANK(Data!I11),\"\",Data!I11)","v":""},{"$f":"IF(ISBLANK(Data!J11),\"\",Data!J11)","v":7},{"$f":"IF(ISBLANK(Data!K11),\"\",Data!K11)","v":1},{"$f":"IF(ISBLANK(Data!L11),\"\",Data!L11)","v":""},{"$f":"IF(ISBLANK(Data!M11),\"\",Data!M11)","v":""},{"$f":"IF(ISBLANK(Data!N11),\"\",Data!N11)","v":3},null,4,56,9,null,null,"Scroll Position"]
[null,null,{"$f":"IF(ISBLANK(Data!C12),\"\",Data!C12)","v":6},{"$f":"IF(ISBLANK(Data!D12),\"\",Data!D12)","v":55},{"$f":"IF(ISBLANK(Data!E12),\"\",Data!E12)","v":10},{"$f":"IF(ISBLANK(Data!F12),\"\",Data!F12)","v":0.182},{"$f":"IF(ISBLANK(Data!G12),\"\",Data!G12)","v":""},{"$f":"IF(ISBLANK(Data!H12),\"\",Data!H12)","v":5},{"$f":"IF(ISBLANK(Data!I12),\"\",Data!I12)","v":""},{"$f":"IF(ISBLANK(Data!J12),\"\",Data!J12)","v":4},{"$f":"IF(ISBLANK(Data!K12),\"\",Data!K12)","v":""},{"$f":"IF(ISBLANK(Data!L12),\"\",Data!L12)","v":""},{"$f":"IF(ISBLANK(Data!M12),\"\",Data!M12)","v":1},{"$f":"IF(ISBLANK(Data!N12),\"\",Data!N12)","v":""},null,5,57,14,null,null,0,{"$f":"\"Week \"&U14&\" Accounts for \"&TEXT(U18,\"0.0%\")&\" of Total Changes\"","v":"Week 1 Accounts for 3.8% of Total Changes"}]
[null,null,{"$f":"IF(ISBLANK(Data!C13),\"\",Data!C13)","v":7},{"$f":"IF(ISBLANK(Data!D13),\"\",Data!D13)","v":51},{"$f":"IF(ISBLANK(Data!E13),\"\",Data!E13)","v":3},{"$f":"IF(ISBLANK(Data!F13),\"\",Data!F13)","v":5.8999999999999997E-2},{"$f":"IF(ISBLANK(Data!G13),\"\",Data!G13)","v":""},{"$f":"IF(ISBLANK(Data!H13),\"\",Data!H13)","v":1},{"$f":"IF(ISBLANK(Data!I13),\"\",Data!I13)","v":""},{"$f":"IF(ISBLANK(Data!J13),\"\",Data!J13)","v":2},{"$f":"IF(ISBLANK(Data!K13),\"\",Data!K13)","v":""},{"$f":"IF(ISBLANK(Data!L13),\"\",Data!L13)","v":""},{"$f":"IF(ISBLANK(Data!M13),\"\",Data!M13)","v":""},{"$f":"IF(ISBLANK(Data!N13),\"\",Data!N13)","v":""},null,6,55,10,null,null,{"$f":"C6","v":"Week"},{"$f":"G6","v":"Quality"},{"$f":"H6","v":"Vendor"},"Attainment","Ops","Planning","Consumption","R&D",{"$f":"N6","v":"Sales"}]
[null,null,{"$f":"IF(ISBLANK(Data!C14),\"\",Data!C14)","v":8},{"$f":"IF(ISBLANK(Data!D14),\"\",Data!D14)","v":52},{"$f":"IF(ISBLANK(Data!E14),\"\",Data!E14)","v":2},{"$f":"IF(ISBLANK(Data!F14),\"\",Data!F14)","v":3.7999999999999999E-2},{"$f":"IF(ISBLANK(Data!G14),\"\",Data!G14)","v":""},{"$f":"IF(ISBLANK(Data!H14),\"\",Data!H14)","v":""},{"$f":"IF(ISBLANK(Data!I14),\"\",Data!I14)","v":""},{"$f":"IF(ISBLANK(Data!J14),\"\",Data!J14)","v":2},{"$f":"IF(ISBLANK(Data!K14),\"\",Data!K14)","v":""},{"$f":"IF(ISBLANK(Data!L14),\"\",Data!L14)","v":""},{"$f":"IF(ISBLANK(Data!M14),\"\",Data!M14)","v":""},{"$f":"IF(ISBLANK(Data!N14),\"\",Data!N14)","v":""},null,7,51,3,null,null,{"$f":"OFFSET(C7,$U$12,0)","v":1},{"$f":"OFFSET(G7,$U$12,0)","v":1},{"$f":"OFFSET(H7,$U$12,0)","v":1},1,1,"","","",""]
[null,null,{"$f":"IF(ISBLANK(Data!C15),\"\",Data!C15)","v":9},{"$f":"IF(ISBLANK(Data!D15),\"\",Data!D15)","v":58},{"$f":"IF(ISBLANK(Data!E15),\"\",Data!E15)","v":10},{"$f":"IF(ISBLANK(Data!F15),\"\",Data!F15)","v":0.17199999999999999},{"$f":"IF(ISBLANK(Data!G15),\"\",Data!G15)","v":1},{"$f":"IF(ISBLANK(Data!H15),\"\",Data!H15)","v":""},{"$f":"IF(ISBLANK(Data!I15),\"\",Data!I15)","v":""},{"$f":"IF(ISBLANK(Data!J15),\"\",Data!J15)","v":5},{"$f":"IF(ISBLANK(Data!K15),\"\",Data!K15)","v":2},{"$f":"IF(ISBLANK(Data!L15),\"\",Data!L15)","v":""},{"$f":"IF(ISBLANK(Data!M15),\"\",Data!M15)","v":""},{"$f":"IF(ISBLANK(Data!N15),\"\",Data!N15)","v":2},null,8,52,2]
[null,null,{"$f":"IF(ISBLANK(Data!C16),\"\",Data!C16)","v":10},{"$f":"IF(ISBLANK(Data!D16),\"\",Data!D16)","v":47},{"$f":"IF(ISBLANK(Data!E16),\"\",Data!E16)","v":3},{"$f":"IF(ISBLANK(Data!F16),\"\",Data!F16)","v":6.4000000000000001E-2},{"$f":"IF(ISBLANK(Data!G16),\"\",Data!G16)","v":""},{"$f":"IF(ISBLANK(Data!H16),\"\",Data!H16)","v":3},{"$f":"IF(ISBLANK(Data!I16),\"\",Data!I16)","v":""},{"$f":"IF(ISBLANK(Data!J16),\"\",Data!J16)","v":""},{"$f":"IF(ISBLANK(Data!K16),\"\",Data!K16)","v":""},{"$f":"IF(ISBLANK(Data!L16),\"\",Data!L16)","v":""},{"$f":"IF(ISBLANK(Data!M16),\"\",Data!M16)","v":""},{"$f":"IF(ISBLANK(Data!N16),\"\",Data!N16)","v":""},null,9,58,10]
[null,null,{"$f":"IF(ISBLANK(Data!C17),\"\",Data!C17)","v":11},{"$f":"IF(ISBLANK(Data!D17),\"\",Data!D17)","v":48},{"$f":"IF(ISBLANK(Data!E17),\"\",Data!E17)","v":1},{"$f":"IF(ISBLANK(Data!F17),\"\",Data!F17)","v":2.1000000000000001E-2},{"$f":"IF(ISBLANK(Data!G17),\"\",Data!G17)","v":""},{"$f":"IF(ISBLANK(Data!H17),\"\",Data!H17)","v":""},{"$f":"IF(ISBLANK(Data!I17),\"\",Data!I17)","v":""},{"$f":"IF(ISBLANK(Data!J17),\"\",Data!J17)","v":""},{"$f":"IF(ISBLANK(Data!K17),\"\",Data!K17)","v":""},{"$f":"IF(ISBLANK(Data!L17),\"\",Data!L17)","v":""},{"$f":"IF(ISBLANK(Data!M17),\"\",Data!M17)","v":""},{"$f":"IF(ISBLANK(Data!N17),\"\",Data!N17)","v":1},null,10,47,3,null,null,"% of total changes"]
[null,null,{"$f":"IF(ISBLANK(Data!C18),\"\",Data!C18)","v":12},{"$f":"IF(ISBLANK(Data!D18),\"\",Data!D18)","v":45},{"$f":"IF(ISBLANK(Data!E18),\"\",Data!E18)","v":2},{"$f":"IF(ISBLANK(Data!F18),\"\",Data!F18)","v":4.3999999999999997E-2},{"$f":"IF(ISBLANK(Data!G18),\"\",Data!G18)","v":""},{"$f":"IF(ISBLANK(Data!H18),\"\",Data!H18)","v":""},{"$f":"IF(ISBLANK(Data!I18),\"\",Data!I18)","v":""},{"$f":"IF(ISBLANK(Data!J18),\"\",Data!J18)","v":1},{"$f":"IF(ISBLANK(Data!K18),\"\",Data!K18)","v":""},{"$f":"IF(ISBLANK(Data!L18),\"\",Data!L18)","v":""},{"$f":"IF(ISBLANK(Data!M18),\"\",Data!M18)","v":1},{"$f":"IF(ISBLANK(Data!N18),\"\",Data!N18)","v":""},null,11,48,1,null,null,{"$f":"SUM($V$14:$AC$14)/SUM($G$7:$N$39)","v":3.8461538461538464E-2}]
[null,null,{"$f":"IF(ISBLANK(Data!C19),\"\",Data!C19)","v":13},{"$f":"IF(ISBLANK(Data!D19),\"\",Data!D19)","v":28},{"$f":"IF(ISBLANK(Data!E19),\"\",Data!E19)","v":1},{"$f":"IF(ISBLANK(Data!F19),\"\",Data!F19)","v":3.5999999999999997E-2},{"$f":"IF(ISBLANK(Data!G19),\"\",Data!G19)","v":""},{"$f":"IF(ISBLANK(Data!H19),\"\",Data!H19)","v":""},{"$f":"IF(ISBLANK(Data!I19),\"\",Data!I19)","v":""},{"$f":"IF(ISBLANK(Data!J19),\"\",Data!J19)","v":""},{"$f":"IF(ISBLANK(Data!K19),\"\",Data!K19)","v":""},{"$f":"IF(ISBLANK(Data!L19),\"\",Data!L19)","v":""},{"$f":"IF(ISBLANK(Data!M19),\"\",Data!M19)","v":""},{"$f":"IF(ISBLANK(Data!N19),\"\",Data!N19)","v":1},null,12,45,2,null,null,{"$f":"100%-U18","v":0.96153846153846156}]
[null,null,{"$f":"IF(ISBLANK(Data!C20),\"\",Data!C20)","v":14},{"$f":"IF(ISBLANK(Data!D20),\"\",Data!D20)","v":42},{"$f":"IF(ISBLANK(Data!E20),\"\",Data!E20)","v":7},{"$f":"IF(ISBLANK(Data!F20),\"\",Data!F20)","v":0.16700000000000001},{"$f":"IF(ISBLANK(Data!G20),\"\",Data!G20)","v":""},{"$f":"IF(ISBLANK(Data!H20),\"\",Data!H20)","v":3},{"$f":"IF(ISBLANK(Data!I20),\"\",Data!I20)","v":""},{"$f":"IF(ISBLANK(Data!J20),\"\",Data!J20)","v":""},{"$f":"IF(ISBLANK(Data!K20),\"\",Data!K20)","v":1},{"$f":"IF(ISBLANK(Data!L20),\"\",Data!L20)","v":""},{"$f":"IF(ISBLANK(Data!M20),\"\",Data!M20)","v":""},{"$f":"IF(ISBLANK(Data!N20),\"\",Data!N20)","v":3},null,13,28,1,null,null,null,"X Axis","Y Axis"]
[null,null,{"$f":"IF(ISBLANK(Data!C21),\"\",Data!C21)","v":15},{"$f":"IF(ISBLANK(Data!D21),\"\",Data!D21)","v":44},{"$f":"IF(ISBLANK(Data!E21),\"\",Data!E21)","v":0},{"$f":"IF(ISBLANK(Data!F21),\"\",Data!F21)","v":0},{"$f":"IF(ISBLANK(Data!G21),\"\",Data!G21)","v":""},{"$f":"IF(ISBLANK(Data!H21),\"\",Data!H21)","v":""},{"$f":"IF(ISBLANK(Data!I21),\"\",Data!I21)","v":""},{"$f":"IF(ISBLANK(Data!J21),\"\",Data!J21)","v":""},{"$f":"IF(ISBLANK(Data!K21),\"\",Data!K21)","v":""},{"$f":"IF(ISBLANK(Data!L21),\"\",Data!L21)","v":""},{"$f":"IF(ISBLANK(Data!M21),\"\",Data!M21)","v":""},{"$f":"IF(ISBLANK(Data!N21),\"\",Data!N21)","v":""},null,14,42,7,null,null,null,2,8]
[null,null,{"$f":"IF(ISBLANK(Data!C22),\"\",Data!C22)","v":16},{"$f":"IF(ISBLANK(Data!D22),\"\",Data!D22)","v":41},{"$f":"IF(ISBLANK(Data!E22),\"\",Data!E22)","v":1},{"$f":"IF(ISBLANK(Data!F22),\"\",Data!F22)","v":2.4E-2},{"$f":"IF(ISBLANK(Data!G22),\"\",Data!G22)","v":""},{"$f":"IF(ISBLANK(Data!H22),\"\",Data!H22)","v":1},{"$f":"IF(ISBLANK(Data!I22),\"\",Data!I22)","v":""},{"$f":"IF(ISBLANK(Data!J22),\"\",Data!J22)","v":""},{"$f":"IF(ISBLANK(Data!K22),\"\",Data!K22)","v":""},{"$f":"IF(ISBLANK(Data!L22),\"\",Data!L22)","v":""},{"$f":"IF(ISBLANK(Data!M22),\"\",Data!M22)","v":""},{"$f":"IF(ISBLANK(Data!N22),\"\",Data!N22)","v":""},null,15,44,0,null,null,"Week",{"$f":"OFFSET($T$23,$V$21-1,0)","v":"Vendor"},{"$f":"OFFSET($T$23,$W$21-1,0)","v":"Sales"}]
[null,null,{"$f":"IF(ISBLANK(Data!C23),\"\",Data!C23)","v":17},{"$f":"IF(ISBLANK(Data!D23),\"\",Data!D23)","v":41},{"$f":"IF(ISBLANK(Data!E23),\"\",Data!E23)","v":0},{"$f":"IF(ISBLANK(Data!F23),\"\",Data!F23)","v":0},{"$f":"IF(ISBLANK(Data!G23),\"\",Data!G23)","v":""},{"$f":"IF(ISBLANK(Data!H23),\"\",Data!H23)","v":""},{"$f":"IF(ISBLANK(Data!I23),\"\",Data!I23)","v":""},{"$f":"IF(ISBLANK(Data!J23),\"\",Data!J23)","v":""},{"$f":"IF(ISBLANK(Data!K23),\"\",Data!K23)","v":""},{"$f":"IF(ISBLANK(Data!L23),\"\",Data!L23)","v":""},{"$f":"IF(ISBLANK(Data!M23),\"\",Data!M23)","v":""},{"$f":"IF(ISBLANK(Data!N23),\"\",Data!N23)","v":""},null,16,41,1,null,"Quality",1,{"$f":"OFFSET(G7,0,$V$21-1)","v":1},{"$f":"OFFSET(G7,0,$W$21-1)","v":""}]
[null,null,{"$f":"IF(ISBLANK(Data!C24),\"\",Data!C24)","v":18},{"$f":"IF(ISBLANK(Data!D24),\"\",Data!D24)","v":39},{"$f":"IF(ISBLANK(Data!E24),\"\",Data!E24)","v":0},{"$f":"IF(ISBLANK(Data!F24),\"\",Data!F24)","v":0},{"$f":"IF(ISBLANK(Data!G24),\"\",Data!G24)","v":""},{"$f":"IF(ISBLANK(Data!H24),\"\",Data!H24)","v":""},{"$f":"IF(ISBLANK(Data!I24),\"\",Data!I24)","v":""},{"$f":"IF(ISBLANK(Data!J24),\"\",Data!J24)","v":""},{"$f":"IF(ISBLANK(Data!K24),\"\",Data!K24)","v":""},{"$f":"IF(ISBLANK(Data!L24),\"\",Data!L24)","v":""},{"$f":"IF(ISBLANK(Data!M24),\"\",Data!M24)","v":""},{"$f":"IF(ISBLANK(Data!N24),\"\",Data!N24)","v":""},null,17,41,0,null,"Vendor",2,{"$f":"OFFSET(G8,0,$V$21-1)","v":""},{"$f":"OFFSET(G8,0,$W$21-1)","v":""}]
[null,null,{"$f":"IF(ISBLANK(Data!C25),\"\",Data!C25)","v":19},{"$f":"IF(ISBLANK(Data!D25),\"\",Data!D25)","v":38},{"$f":"IF(ISBLANK(Data!E25),\"\",Data!E25)","v":1},{"$f":"IF(ISBLANK(Data!F25),\"\",Data!F25)","v":2.5999999999999999E-2},{"$f":"IF(ISBLANK(Data!G25),\"\",Data!G25)","v":""},{"$f":"IF(ISBLANK(Data!H25),\"\",Data!H25)","v":1},{"$f":"IF(ISBLANK(Data!I25),\"\",Data!I25)","v":""},{"$f":"IF(ISBLANK(Data!J25),\"\",Data!J25)","v":""},{"$f":"IF(ISBLANK(Data!K25),\"\",Data!K25)","v":""},{"$f":"IF(ISBLANK(Data!L25),\"\",Data!L25)","v":""},{"$f":"IF(ISBLANK(Data!M25),\"\",Data!M25)","v":""},{"$f":"IF(ISBLANK(Data!N25),\"\",Data!N25)","v":""},null,18,39,0,null,"Attainment",3,{"$f":"OFFSET(G9,0,$V$21-1)","v":3},{"$f":"OFFSET(G9,0,$W$21-1)","v":""}]
[null,null,{"$f":"IF(ISBLANK(Data!C26),\"\",Data!C26)","v":20},{"$f":"IF(ISBLANK(Data!D26),\"\",Data!D26)","v":46},{"$f":"IF(ISBLANK(Data!E26),\"\",Data!E26)","v":1},{"$f":"IF(ISBLANK(Data!F26),\"\",Data!F26)","v":2.1999999999999999E-2},{"$f":"IF(ISBLANK(Data!G26),\"\",Data!G26)","v":""},{"$f":"IF(ISBLANK(Data!H26),\"\",Data!H26)","v":1},{"$f":"IF(ISBLANK(Data!I26),\"\",Data!I26)","v":""},{"$f":"IF(ISBLANK(Data!J26),\"\",Data!J26)","v":""},{"$f":"IF(ISBLANK(Data!K26),\"\",Data!K26)","v":""},{"$f":"IF(ISBLANK(Data!L26),\"\",Data!L26)","v":""},{"$f":"IF(ISBLANK(Data!M26),\"\",Data!M26)","v":""},{"$f":"IF(ISBLANK(Data!N26),\"\",Data!N26)","v":""},null,19,38,1,null,"Ops",4,{"$f":"OFFSET(G10,0,$V$21-1)","v":2},{"$f":"OFFSET(G10,0,$W$21-1)","v":""}]
[null,null,{"$f":"IF(ISBLANK(Data!C27),\"\",Data!C27)","v":21},{"$f":"IF(ISBLANK(Data!D27),\"\",Data!D27)","v":38},{"$f":"IF(ISBLANK(Data!E27),\"\",Data!E27)","v":0},{"$f":"IF(ISBLANK(Data!F27),\"\",Data!F27)","v":0},{"$f":"IF(ISBLANK(Data!G27),\"\",Data!G27)","v":""},{"$f":"IF(ISBLANK(Data!H27),\"\",Data!H27)","v":""},{"$f":"IF(ISBLANK(Data!I27),\"\",Data!I27)","v":""},{"$f":"IF(ISBLANK(Data!J27),\"\",Data!J27)","v":""},{"$f":"IF(ISBLANK(Data!K27),\"\",Data!K27)","v":""},{"$f":"IF(ISBLANK(Data!L27),\"\",Data!L27)","v":""},{"$f":"IF(ISBLANK(Data!M27),\"\",Data!M27)","v":""},{"$f":"IF(ISBLANK(Data!N27),\"\",Data!N27)","v":""},null,20,46,1,null,"Planning",5,{"$f":"OFFSET(G11,0,$V$21-1)","v":3},{"$f":"OFFSET(G11,0,$W$21-1)","v":3}]
[null,null,{"$f":"IF(ISBLANK(Data!C28),\"\",Data!C28)","v":22},{"$f":"IF(ISBLANK(Data!D28),\"\",Data!D28)","v":38},{"$f":"IF(ISBLANK(Data!E28),\"\",Data!E28)","v":1},{"$f":"IF(ISBLANK(Data!F28),\"\",Data!F28)","v":2.5999999999999999E-2},{"$f":"IF(ISBLANK(Data!G28),\"\",Data!G28)","v":""},{"$f":"IF(ISBLANK(Data!H28),\"\",Data!H28)","v":1},{"$f":"IF(ISBLANK(Data!I28),\"\",Data!I28)","v":""},{"$f":"IF(ISBLANK(Data!J28),\"\",Data!J28)","v":""},{"$f":"IF(ISBLANK(Data!K28),\"\",Data!K28)","v":""},{"$f":"IF(ISBLANK(Data!L28),\"\",Data!L28)","v":""},{"$f":"IF(ISBLANK(Data!M28),\"\",Data!M28)","v":""},{"$f":"IF(ISBLANK(Data!N28),\"\",Data!N28)","v":""},null,21,38,0,null,"Consumption",6,{"$f":"OFFSET(G12,0,$V$21-1)","v":5},{"$f":"OFFSET(G12,0,$W$21-1)","v":""}]
[null,null,{"$f":"IF(ISBLANK(Data!C29),\"\",Data!C29)","v":23},{"$f":"IF(ISBLANK(Data!D29),\"\",Data!D29)","v":49},{"$f":"IF(ISBLANK(Data!E29),\"\",Data!E29)","v":0},{"$f":"IF(ISBLANK(Data!F29),\"\",Data!F29)","v":0},{"$f":"IF(ISBLANK(Data!G29),\"\",Data!G29)","v":""},{"$f":"IF(ISBLANK(Data!H29),\"\",Data!H29)","v":""},{"$f":"IF(ISBLANK(Data!I29),\"\",Data!I29)","v":""},{"$f":"IF(ISBLANK(Data!J29),\"\",Data!J29)","v":""},{"$f":"IF(ISBLANK(Data!K29),\"\",Data!K29)","v":""},{"$f":"IF(ISBLANK(Data!L29),\"\",Data!L29)","v":""},{"$f":"IF(ISBLANK(Data!M29),\"\",Data!M29)","v":""},{"$f":"IF(ISBLANK(Data!N29),\"\",Data!N29)","v":""},null,22,38,1,null,"R&D",7,{"$f":"OFFSET(G13,0,$V$21-1)","v":1},{"$f":"OFFSET(G13,0,$W$21-1)","v":""}]
[null,null,{"$f":"IF(ISBLANK(Data!C30),\"\",Data!C30)","v":24},{"$f":"IF(ISBLANK(Data!D30),\"\",Data!D30)","v":34},{"$f":"IF(ISBLANK(Data!E30),\"\",Data!E30)","v":2},{"$f":"IF(ISBLANK(Data!F30),\"\",Data!F30)","v":5.8999999999999997E-2},{"$f":"IF(ISBLANK(Data!G30),\"\",Data!G30)","v":""},{"$f":"IF(ISBLANK(Data!H30),\"\",Data!H30)","v":2},{"$f":"IF(ISBLANK(Data!I30),\"\",Data!I30)","v":""},{"$f":"IF(ISBLANK(Data!J30),\"\",Data!J30)","v":""},{"$f":"IF(ISBLANK(Data!K30),\"\",Data!K30)","v":""},{"$f":"IF(ISBLANK(Data!L30),\"\",Data!L30)","v":""},{"$f":"IF(ISBLANK(Data!M30),\"\",Data!M30)","v":""},{"$f":"IF(ISBLANK(Data!N30),\"\",Data!N30)","v":""},null,23,49,0,null,"Sales",8,{"$f":"OFFSET(G14,0,$V$21-1)","v":""},{"$f":"OFFSET(G14,0,$W$21-1)","v":""}]
[null,null,{"$f":"IF(ISBLANK(Data!C31),\"\",Data!C31)","v":25},{"$f":"IF(ISBLANK(Data!D31),\"\",Data!D31)","v":33},{"$f":"IF(ISBLANK(Data!E31),\"\",Data!E31)","v":3},{"$f":"IF(ISBLANK(Data!F31),\"\",Data!F31)","v":9.0999999999999998E-2},{"$f":"IF(ISBLANK(Data!G31),\"\",Data!G31)","v":""},{"$f":"IF(ISBLANK(Data!H31),\"\",Data!H31)","v":3},{"$f":"IF(ISBLANK(Data!I31),\"\",Data!I31)","v":""},{"$f":"IF(ISBLANK(Data!J31),\"\",Data!J31)","v":""},{"$f":"IF(ISBLANK(Data!K31),\"\",Data!K31)","v":""},{"$f":"IF(ISBLANK(Data!L31),\"\",Data!L31)","v":""},{"$f":"IF(ISBLANK(Data!M31),\"\",Data!M31)","v":""},{"$f":"IF(ISBLANK(Data!N31),\"\",Data!N31)","v":""},null,24,34,2,null,null,9,{"$f":"OFFSET(G15,0,$V$21-1)","v":""},{"$f":"OFFSET(G15,0,$W$21-1)","v":2}]
[null,null,{"$f":"IF(ISBLANK(Data!C32),\"\",Data!C32)","v":26},{"$f":"IF(ISBLANK(Data!D32),\"\",Data!D32)","v":32},{"$f":"IF(ISBLANK(Data!E32),\"\",Data!E32)","v":6},{"$f":"IF(ISBLANK(Data!F32),\"\",Data!F32)","v":0.188},{"$f":"IF(ISBLANK(Data!G32),\"\",Data!G32)","v":""},{"$f":"IF(ISBLANK(Data!H32),\"\",Data!H32)","v":5},{"$f":"IF(ISBLANK(Data!I32),\"\",Data!I32)","v":""},{"$f":"IF(ISBLANK(Data!J32),\"\",Data!J32)","v":""},{"$f":"IF(ISBLANK(Data!K32),\"\",Data!K32)","v":1},{"$f":"IF(ISBLANK(Data!L32),\"\",Data!L32)","v":""},{"$f":"IF(ISBLANK(Data!M32),\"\",Data!M32)","v":""},{"$f":"IF(ISBLANK(Data!N32),\"\",Data!N32)","v":""},null,25,33,3,null,null,10,{"$f":"OFFSET(G16,0,$V$21-1)","v":3},{"$f":"OFFSET(G16,0,$W$21-1)","v":""}]
[null,null,{"$f":"IF(ISBLANK(Data!C33),\"\",Data!C33)","v":27},{"$f":"IF(ISBLANK(Data!D33),\"\",Data!D33)","v":18},{"$f":"IF(ISBLANK(Data!E33),\"\",Data!E33)","v":0},{"$f":"IF(ISBLANK(Data!F33),\"\",Data!F33)","v":0},{"$f":"IF(ISBLANK(Data!G33),\"\",Data!G33)","v":""},{"$f":"IF(ISBLANK(Data!H33),\"\",Data!H33)","v":""},{"$f":"IF(ISBLANK(Data!I33),\"\",Data!I33)","v":""},{"$f":"IF(ISBLANK(Data!J33),\"\",Data!J33)","v":""},{"$f":"IF(ISBLANK(Data!K33),\"\",Data!K33)","v":""},{"$f":"IF(ISBLANK(Data!L33),\"\",Data!L33)","v":""},{"$f":"IF(ISBLANK(Data!M33),\"\",Data!M33)","v":""},{"$f":"IF(ISBLANK(Data!N33),\"\",Data!N33)","v":""},null,26,32,6,null,null,11,{"$f":"OFFSET(G17,0,$V$21-1)","v":""},{"$f":"OFFSET(G17,0,$W$21-1)","v":1}]
[null,null,{"$f":"IF(ISBLANK(Data!C34),\"\",Data!C34)","v":28},{"$f":"IF(ISBLANK(Data!D34),\"\",Data!D34)","v":37},{"$f":"IF(ISBLANK(Data!E34),\"\",Data!E34)","v":2},{"$f":"IF(ISBLANK(Data!F34),\"\",Data!F34)","v":5.3999999999999999E-2},{"$f":"IF(ISBLANK(Data!G34),\"\",Data!G34)","v":""},{"$f":"IF(ISBLANK(Data!H34),\"\",Data!H34)","v":2},{"$f":"IF(ISBLANK(Data!I34),\"\",Data!I34)","v":""},{"$f":"IF(ISBLANK(Data!J34),\"\",Data!J34)","v":""},{"$f":"IF(ISBLANK(Data!K34),\"\",Data!K34)","v":""},{"$f":"IF(ISBLANK(Data!L34),\"\",Data!L34)","v":""},{"$f":"IF(ISBLANK(Data!M34),\"\",Data!M34)","v":""},{"$f":"IF(ISBLANK(Data!N34),\"\",Data!N34)","v":""},null,27,18,0,null,null,12,{"$f":"OFFSET(G18,0,$V$21-1)","v":""},{"$f":"OFFSET(G18,0,$W$21-1)","v":""}]
[null,null,{"$f":"IF(ISBLANK(Data!C35),\"\",Data!C35)","v":29},{"$f":"IF(ISBLANK(Data!D35),\"\",Data!D35)","v":34},{"$f":"IF(ISBLANK(Data!E35),\"\",Data!E35)","v":4},{"$f":"IF(ISBLANK(Data!F35),\"\",Data!F35)","v":0.11799999999999999},{"$f":"IF(ISBLANK(Data!G35),\"\",Data!G35)","v":""},{"$f":"IF(ISBLANK(Data!H35),\"\",Data!H35)","v":""},{"$f":"IF(ISBLANK(Data!I35),\"\",Data!I35)","v":""},{"$f":"IF(ISBLANK(Data!J35),\"\",Data!J35)","v":4},{"$f":"IF(ISBLANK(Data!K35),\"\",Data!K35)","v":""},{"$f":"IF(ISBLANK(Data!L35),\"\",Data!L35)","v":""},{"$f":"IF(ISBLANK(Data!M35),\"\",Data!M35)","v":""},{"$f":"IF(ISBLANK(Data!N35),\"\",Data!N35)","v":""},null,28,37,2,null,null,13,{"$f":"OFFSET(G19,0,$V$21-1)","v":""},{"$f":"OFFSET(G19,0,$W$21-1)","v":1}]
[null,null,{"$f":"IF(ISBLANK(Data!C36),\"\",Data!C36)","v":30},{"$f":"IF(ISBLANK(Data!D36),\"\",Data!D36)","v":32},{"$f":"IF(ISBLANK(Data!E36),\"\",Data!E36)","v":0},{"$f":"IF(ISBLANK(Data!F36),\"\",Data!F36)","v":0},{"$f":"IF(ISBLANK(Data!G36),\"\",Data!G36)","v":""},{"$f":"IF(ISBLANK(Data!H36),\"\",Data!H36)","v":""},{"$f":"IF(ISBLANK(Data!I36),\"\",Data!I36)","v":""},{"$f":"IF(ISBLANK(Data!J36),\"\",Data!J36)","v":""},{"$f":"IF(ISBLANK(Data!K36),\"\",Data!K36)","v":""},{"$f":"IF(ISBLANK(Data!L36),\"\",Data!L36)","v":""},{"$f":"IF(ISBLANK(Data!M36),\"\",Data!M36)","v":""},{"$f":"IF(ISBLANK(Data!N36),\"\",Data!N36)","v":""},null,29,34,4,null,null,14,{"$f":"OFFSET(G20,0,$V$21-1)","v":3},{"$f":"OFFSET(G20,0,$W$21-1)","v":3}]
[null,null,{"$f":"IF(ISBLANK(Data!C37),\"\",Data!C37)","v":31},{"$f":"IF(ISBLANK(Data!D37),\"\",Data!D37)","v":31},{"$f":"IF(ISBLANK(Data!E37),\"\",Data!E37)","v":1},{"$f":"IF(ISBLANK(Data!F37),\"\",Data!F37)","v":3.2000000000000001E-2},{"$f":"IF(ISBLANK(Data!G37),\"\",Data!G37)","v":""},{"$f":"IF(ISBLANK(Data!H37),\"\",Data!H37)","v":""},{"$f":"IF(ISBLANK(Data!I37),\"\",Data!I37)","v":""},{"$f":"IF(ISBLANK(Data!J37),\"\",Data!J37)","v":1},{"$f":"IF(ISBLANK(Data!K37),\"\",Data!K37)","v":""},{"$f":"IF(ISBLANK(Data!L37),\"\",Data!L37)","v":""},{"$f":"IF(ISBLANK(Data!M37),\"\",Data!M37)","v":""},{"$f":"IF(ISBLANK(Data!N37),\"\",Data!N37)","v":""},null,30,32,0,null,null,15,{"$f":"OFFSET(G21,0,$V$21-1)","v":""},{"$f":"OFFSET(G21,0,$W$21-1)","v":""}]
[null,null,{"$f":"IF(ISBLANK(Data!C38),\"\",Data!C38)","v":32},{"$f":"IF(ISBLANK(Data!D38),\"\",Data!D38)","v":33},{"$f":"IF(ISBLANK(Data!E38),\"\",Data!E38)","v":5},{"$f":"IF(ISBLANK(Data!F38),\"\",Data!F38)","v":0.152},{"$f":"IF(ISBLANK(Data!G38),\"\",Data!G38)","v":""},{"$f":"IF(ISBLANK(Data!H38),\"\",Data!H38)","v":""},{"$f":"IF(ISBLANK(Data!I38),\"\",Data!I38)","v":""},{"$f":"IF(ISBLANK(Data!J38),\"\",Data!J38)","v":5},{"$f":"IF(ISBLANK(Data!K38),\"\",Data!K38)","v":""},{"$f":"IF(ISBLANK(Data!L38),\"\",Data!L38)","v":""},{"$f":"IF(ISBLANK(Data!M38),\"\",Data!M38)","v":""},{"$f":"IF(ISBLANK(Data!N38),\"\",Data!N38)","v":""},null,31,31,1,null,null,16,{"$f":"OFFSET(G22,0,$V$21-1)","v":1},{"$f":"OFFSET(G22,0,$W$21-1)","v":""}]
[null,null,{"$f":"IF(ISBLANK(Data!C39),\"\",Data!C39)","v":33},{"$f":"IF(ISBLANK(Data!D39),\"\",Data!D39)","v":33},{"$f":"IF(ISBLANK(Data!E39),\"\",Data!E39)","v":1},{"$f":"IF(ISBLANK(Data!F39),\"\",Data!F39)","v":0.03},{"$f":"IF(ISBLANK(Data!G39),\"\",Data!G39)","v":""},{"$f":"IF(ISBLANK(Data!H39),\"\",Data!H39)","v":""},{"$f":"IF(ISBLANK(Data!I39),\"\",Data!I39)","v":1},{"$f":"IF(ISBLANK(Data!J39),\"\",Data!J39)","v":""},{"$f":"IF(ISBLANK(Data!K39),\"\",Data!K39)","v":""},{"$f":"IF(ISBLANK(Data!L39),\"\",Data!L39)","v":""},{"$f":"IF(ISBLANK(Data!M39),\"\",Data!M39)","v":""},{"$f":"IF(ISBLANK(Data!N39),\"\",Data!N39)","v":""},null,32,33,5,null,null,17,{"$f":"OFFSET(G23,0,$V$21-1)","v":""},{"$f":"OFFSET(G23,0,$W$21-1)","v":""}]
[null,null,{"$f":"IF(ISBLANK(Data!C40),\"\",Data!C40)","v":"Totals"},{"$f":"IF(ISBLANK(Data!D40),\"\",Data!D40)","v":1391},{"$f":"IF(ISBLANK(Data!E40),\"\",Data!E40)","v":104},{"$f":"IF(ISBLANK(Data!F40),\"\",Data!F40)","v":7.4800000000000005E-2},{"$f":"IF(ISBLANK(Data!G40),\"\",Data!G40)","v":3},{"$f":"IF(ISBLANK(Data!H40),\"\",Data!H40)","v":37},{"$f":"IF(ISBLANK(Data!I40),\"\",Data!I40)","v":5},{"$f":"IF(ISBLANK(Data!J40),\"\",Data!J40)","v":38},{"$f":"IF(ISBLANK(Data!K40),\"\",Data!K40)","v":6},{"$f":"IF(ISBLANK(Data!L40),\"\",Data!L40)","v":0},{"$f":"IF(ISBLANK(Data!M40),\"\",Data!M40)","v":5},{"$f":"IF(ISBLANK(Data!N40),\"\",Data!N40)","v":10},null,33,33,1,null,null,18,{"$f":"OFFSET(G24,0,$V$21-1)","v":""},{"$f":"OFFSET(G24,0,$W$21-1)","v":""}]
[null,null,null,null,null,null,null,null,null,null,null,null,null,null,null,null,null,null,null,null,19,{"$f":"OFFSET(G25,0,$V$21-1)","v":1},{"$f":"OFFSET(G25,0,$W$21-1)","v":""}]
[null,null,null,null,null,null,null,null,null,null,null,null,null,null,null,null,null,null,null,null,20,{"$f":"OFFSET(G26,0,$V$21-1)","v":1},{"$f":"OFFSET(G26,0,$W$21-1)","v":""}]
[null,null,null,null,null,null,null,null,null,null,null,null,null,null,null,null,null,null,null,null,21,{"$f":"OFFSET(G27,0,$V$21-1)","v":""},{"$f":"OFFSET(G27,0,$W$21-1)","v":""}]
[null,null,null,null,null,null,null,null,null,null,null,null,null,null,null,null,null,null,null,null,22,{"$f":"OFFSET(G28,0,$V$21-1)","v":1},{"$f":"OFFSET(G28,0,$W$21-1)","v":""}]
[null,null,null,null,null,null,null,null,null,null,null,null,null,null,null,null,null,null,null,null,23,{"$f":"OFFSET(G29,0,$V$21-1)","v":""},{"$f":"OFFSET(G29,0,$W$21-1)","v":""}]
[null,null,null,null,null,null,null,null,null,null,null,null,null,null,null,null,null,null,null,null,24,{"$f":"OFFSET(G30,0,$V$21-1)","v":2},{"$f":"OFFSET(G30,0,$W$21-1)","v":""}]
[null,null,null,null,null,null,null,null,null,null,null,null,null,null,null,null,null,null,null,null,25,{"$f":"OFFSET(G31,0,$V$21-1)","v":3},{"$f":"OFFSET(G31,0,$W$21-1)","v":""}]
[null,null,null,null,null,null,null,null,null,null,null,null,null,null,null,null,null,null,null,null,26,{"$f":"OFFSET(G32,0,$V$21-1)","v":5},{"$f":"OFFSET(G32,0,$W$21-1)","v":""}]
[null,null,null,null,null,null,null,null,null,null,null,null,null,null,null,null,null,null,null,null,27,{"$f":"OFFSET(G33,0,$V$21-1)","v":""},{"$f":"OFFSET(G33,0,$W$21-1)","v":""}]
[null,null,null,null,null,null,null,null,null,null,null,null,null,null,null,null,null,null,null,null,28,{"$f":"OFFSET(G34,0,$V$21-1)","v":2},{"$f":"OFFSET(G34,0,$W$21-1)","v":""}]
[null,null,null,null,null,null,null,null,null,null,null,null,null,null,null,null,null,null,null,null,29,{"$f":"OFFSET(G35,0,$V$21-1)","v":""},{"$f":"OFFSET(G35,0,$W$21-1)","v":""}]
[null,null,null,null,null,null,null,null,null,null,null,null,null,null,null,null,null,null,null,null,30,{"$f":"OFFSET(G36,0,$V$21-1)","v":""},{"$f":"OFFSET(G36,0,$W$21-1)","v":""}]
[null,null,null,null,null,null,null,null,null,null,null,null,null,null,null,null,null,null,null,null,31,{"$f":"OFFSET(G37,0,$V$21-1)","v":""},{"$f":"OFFSET(G37,0,$W$21-1)","v":""}]
[null,null,null,null,null,null,null,null,null,null,null,null,null,null,null,null,null,null,null,null,32,{"$f":"OFFSET(G38,0,$V$21-1)","v":""},{"$f":"OFFSET(G38,0,$W$21-1)","v":""}]
[null,null,null,null,null,null,null,null,null,null,null,null,null,null,null,null,null,null,null,null,33,{"$f":"OFFSET(G39,0,$V$21-1)","v":""},{"$f":"OFFSET(G39,0,$W$21-1)","v":""}]

{"sheet":"Dashboard","index":2,"n_rows":0,"n_cols":0,"rows_kept":0,"cut":false,"hidden":false,"merged":[]}