{"text_format":"1","workbook":"xlsx","n_sheets":3,"sheets":["Sheet1","Sheet2","Sheet3"],"not_rendered":{"charts":2,"images":0,"macros":1,"external_links":0,"defined_names":0,"comments":0,"pivot_tables":0},"unopened":[],"bounds":{"document_bytes":16777216,"sheet_cells":100000,"rows_first":2000,"rows_last":500,"rows_between":2000,"halvings":0,"cell_chars":16384,"cell_head_chars":4096},"cells_cut":0,"cells_raw":0,"read":"whole","date_system":"1900"}

{"sheet":"Sheet1","index":0,"n_rows":56,"n_cols":12,"rows_kept":56,"cut":false,"hidden":false,"merged":[]}
[null,"Subject 1","Subject 2","Subject 3"]
["Series 1",null,1,1]
["Series 2",null,null,1]
["Series 3",5,4,1]
["Series 4",2,null,9]
["Series 5",null,null,3]
["Series 6",null,2,3]
["Series 7",7,null,2]
["Series 8",null,null,6]
["Series 9",null,null,4]
["Series 10",null,null,5]
[]
[]
[]
[]
[]
[]
[]
[]
[]
[]
[null,"Count",{"$f":"COUNT(B$2:B$11)","v":3},{"$f":"COUNT(C$2:C$11)","v":3},10]
[]
[null,null,"Series 1","Series 2","Series 3","Series 4","Series 5","Series 6","Series 7","Series 8","Series 9","Series 10"]
["Subject 1",{"$f":"IF(ROWS(B$25:B25)>$C$22,1/0,INDEX($A$2:$A$11,SMALL(IF(ISNUMBER($B$2:$B$11),ROW($A$2:$A$11)-ROW($A$2)+1),ROWS(B$25:B25))))","v":"Series 3"},{"$f":"IF($B25<>C$24,\"\",IF(ISNUMBER(INDEX($B$2:$D$11,MATCH($B25,$A$2:$A$11,0),MATCH($A$25,$B$1:$D$1,0))),INDEX($B$2:$D$11,MATCH($B25,$A$2:$A$11,0),MATCH($A$25,$B$1:$D$1,0)),\"Error\"))","v":""},{"$f":"IF($B25<>D$24,\"\",IF(ISNUMBER(INDEX($B$2:$D$11,MATCH($B25,$A$2:$A$11,0),MATCH($A$25,$B$1:$D$1,0))),INDEX($B$2:$D$11,MATCH($B25,$A$2:$A$11,0),MATCH($A$25,$B$1:$D$1,0)),\"Error\"))","v":""},5,"","","","","","",""]
[null,{"$f":"IF(ROWS(B$25:B26)>$C$22,1/0,INDEX($A$2:$A$11,SMALL(IF(ISNUMBER($B$2:$B$11),ROW($A$2:$A$11)-ROW($A$2)+1),ROWS(B$25:B26))))","v":"Series 4"},{"$f":"IF($B26<>C$24,\"\",IF(ISNUMBER(INDEX($B$2:$D$11,MATCH($B26,$A$2:$A$11,0),MATCH($A$25,$B$1:$D$1,0))),INDEX($B$2:$D$11,MATCH($B26,$A$2:$A$11,0),MATCH($A$25,$B$1:$D$1,0)),\"Error\"))","v":""},"","",2,"","","","","",""]
[null,{"$f":"IF(ROWS(B$25:B27)>$C$22,1/0,INDEX($A$2:$A$11,SMALL(IF(ISNUMBER($B$2:$B$11),ROW($A$2:$A$11)-ROW($A$2)+1),ROWS(B$25:B27))))","v":"Series 7"},"","","","","","",7,"","",""]
[null,{"$f":"IF(ROWS(B$25:B28)>$C$22,1/0,INDEX($A$2:$A$11,SMALL(IF(ISNUMBER($B$2:$B$11),ROW($A$2:$A$11)-ROW($A$2)+1),ROWS(B$25:B28))))","v":{"$error":"#DIV/0!"}},{"$error":"#DIV/0!"},{"$error":"#DIV/0!"},{"$error":"#DIV/0!"},{"$error":"#DIV/0!"},{"$error":"#DIV/0!"},{"$error":"#DIV/0!"},{"$error":"#DIV/0!"},{"$error":"#DIV/0!"},{"$error":"#DIV/0!"},{"$error":"#DIV/0!"}]
[null,{"$f":"IF(ROWS(B$25:B29)>$C$22,1/0,INDEX($A$2:$A$11,SMALL(IF(ISNUMBER($B$2:$B$11),ROW($A$2:$A$11)-ROW($A$2)+1),ROWS(B$25:B29))))","v":{"$error":"#DIV/0!"}},{"$error":"#DIV/0!"},{"$error":"#DIV/0!"},{"$error":"#DIV/0!"},{"$error":"#DIV/0!"},{"$error":"#DIV/0!"},{"$error":"#DIV/0!"},{"$error":"#DIV/0!"},{"$error":"#DIV/0!"},{"$error":"#DIV/0!"},{"$error":"#DIV/0!"}]
[null,{"$f":"IF(ROWS(B$25:B30)>$C$22,1/0,INDEX($A$2:$A$11,SMALL(IF(ISNUMBER($B$2:$B$11),ROW($A$2:$A$11)-ROW($A$2)+1),ROWS(B$25:B30))))","v":{"$error":"#DIV/0!"}},{"$error":"#DIV/0!"},{"$error":"#DIV/0!"},{"$error":"#DIV/0!"},{"$error":"#DIV/0!"},{"$error":"#DIV/0!"},{"$error":"#DIV/0!"},{"$error":"#DIV/0!"},{"$error":"#DIV/0!"},{"$error":"#DIV/0!"},{"$error":"#DIV/0!"}]
[null,{"$f":"IF(ROWS(B$25:B31)>$C$22,1/0,INDEX($A$2:$A$11,SMALL(IF(ISNUMBER($B$2:$B$11),ROW($A$2:$A$11)-ROW($A$2)+1),ROWS(B$25:B31))))","v":{"$error":"#DIV/0!"}},{"$error":"#DIV/0!"},{"$error":"#DIV/0!"},{"$error":"#DIV/0!"},{"$error":"#DIV/0!"},{"$error":"#DIV/0!"},{"$error":"#DIV/0!"},{"$error":"#DIV/0!"},{"$error":"#DIV/0!"},{"$error":"#DIV/0!"},{"$error":"#DIV/0!"}]
[null,{"$f":"IF(ROWS(B$25:B32)>$C$22,1/0,INDEX($A$2:$A$11,SMALL(IF(ISNUMBER($B$2:$B$11),ROW($A$2:$A$11)-ROW($A$2)+1),ROWS(B$25:B32))))","v":{"$error":"#DIV/0!"}},{"$error":"#DIV/0!"},{"$error":"#DIV/0!"},{"$error":"#DIV/0!"},{"$error":"#DIV/0!"},{"$error":"#DIV/0!"},{"$error":"#DIV/0!"},{"$error":"#DIV/0!"},{"$error":"#DIV/0!"},{"$error":"#DIV/0!"},{"$error":"#DIV/0!"}]
[null,{"$f":"IF(ROWS(B$25:B33)>$C$22,1/0,INDEX($A$2:$A$11,SMALL(IF(ISNUMBER($B$2:$B$11),ROW($A$2:$A$11)-ROW($A$2)+1),ROWS(B$25:B33))))","v":{"$error":"#DIV/0!"}},{"$error":"#DIV/0!"},{"$error":"#DIV/0!"},{"$error":"#DIV/0!"},{"$error":"#DIV/0!"},{"$error":"#DIV/0!"},{"$error":"#DIV/0!"},{"$error":"#DIV/0!"},{"$error":"#DIV/0!"},{"$error":"#DIV/0!"},{"$error":"#DIV/0!"}]
[null,{"$f":"IF(ROWS(B$25:B34)>$C$22,1/0,INDEX($A$2:$A$11,SMALL(IF(ISNUMBER($B$2:$B$11),ROW($A$2:$A$11)-ROW($A$2)+1),ROWS(B$25:B34))))","v":{"$error":"#DIV/0!"}},{"$error":"#DIV/0!"},{"$error":"#DIV/0!"},{"$error":"#DIV/0!"},{"$error":"#DIV/0!"},{"$error":"#DIV/0!"},{"$error":"#DIV/0!"},{"$error":"#DIV/0!"},{"$error":"#DIV/0!"},{"$error":"#DIV/0!"},{"$error":"#DIV/0!"}]
[" "]
["Subject 2",{"$f":"IF(ROWS(B$36:B36)>$D$22,1/0,INDEX($A$2:$A$11,SMALL(IF(ISNUMBER($C$2:$C$11),ROW($A$2:$A$11)-ROW($A$2)+1),ROWS(B$36:B36))))","v":"Series 1"},{"$f":"IF($B36<>C$24,\"\",IF(ISNUMBER(INDEX($B$2:$D$11,MATCH($B36,$A$2:$A$11,0),MATCH($A$36,$B$1:$D$1,0))),INDEX($B$2:$D$11,MATCH($B36,$A$2:$A$11,0),MATCH($A$36,$B$1:$D$1,0)),\"Error\"))","v":1},{"$f":"IF($B36<>D$24,\"\",IF(ISNUMBER(INDEX($B$2:$D$11,MATCH($B36,$A$2:$A$11,0),MATCH($A$36,$B$1:$D$1,0))),INDEX($B$2:$D$11,MATCH($B36,$A$2:$A$11,0),MATCH($A$36,$B$1:$D$1,0)),\"Error\"))","v":""},"","","","","","","",""]
[null,{"$f":"IF(ROWS(B$36:B37)>$D$22,1/0,INDEX($A$2:$A$11,SMALL(IF(ISNUMBER($C$2:$C$11),ROW($A$2:$A$11)-ROW($A$2)+1),ROWS(B$36:B37))))","v":"Series 3"},{"$f":"IF($B37<>C$24,\"\",IF(ISNUMBER(INDEX($B$2:$D$11,MATCH($B37,$A$2:$A$11,0),MATCH($A$36,$B$1:$D$1,0))),INDEX($B$2:$D$11,MATCH($B37,$A$2:$A$11,0),MATCH($A$36,$B$1:$D$1,0)),\"Error\"))","v":""},"",4,"","","","","","",""]
[null,{"$f":"IF(ROWS(B$36:B38)>$D$22,1/0,INDEX($A$2:$A$11,SMALL(IF(ISNUMBER($C$2:$C$11),ROW($A$2:$A$11)-ROW($A$2)+1),ROWS(B$36:B38))))","v":"Series 6"},"","","","","",2,"","","",""]
[null,{"$f":"IF(ROWS(B$36:B39)>$D$22,1/0,INDEX($A$2:$A$11,SMALL(IF(ISNUMBER($C$2:$C$11),ROW($A$2:$A$11)-ROW($A$2)+1),ROWS(B$36:B39))))","v":{"$error":"#DIV/0!"}},{"$error":"#DIV/0!"},{"$error":"#DIV/0!"},{"$error":"#DIV/0!"},{"$error":"#DIV/0!"},{"$error":"#DIV/0!"},{"$error":"#DIV/0!"},{"$error":"#DIV/0!"},{"$error":"#DIV/0!"},{"$error":"#DIV/0!"},{"$error":"#DIV/0!"}]
[null,{"$f":"IF(ROWS(B$36:B40)>$D$22,1/0,INDEX($A$2:$A$11,SMALL(IF(ISNUMBER($C$2:$C$11),ROW($A$2:$A$11)-ROW($A$2)+1),ROWS(B$36:B40))))","v":{"$error":"#DIV/0!"}},{"$error":"#DIV/0!"},{"$error":"#DIV/0!"},{"$error":"#DIV/0!"},{"$error":"#DIV/0!"},{"$error":"#DIV/0!"},{"$error":"#DIV/0!"},{"$error":"#DIV/0!"},{"$error":"#DIV/0!"},{"$error":"#DIV/0!"},{"$error":"#DIV/0!"}]
[null,{"$f":"IF(ROWS(B$36:B41)>$D$22,1/0,INDEX($A$2:$A$11,SMALL(IF(ISNUMBER($C$2:$C$11),ROW($A$2:$A$11)-ROW($A$2)+1),ROWS(B$36:B41))))","v":{"$error":"#DIV/0!"}},{"$error":"#DIV/0!"},{"$error":"#DIV/0!"},{"$error":"#DIV/0!"},{"$error":"#DIV/0!"},{"$error":"#DIV/0!"},{"$error":"#DIV/0!"},{"$error":"#DIV/0!"},{"$error":"#DIV/0!"},{"$error":"#DIV/0!"},{"$error":"#DIV/0!"}]
[null,{"$f":"IF(ROWS(B$36:B42)>$D$22,1/0,INDEX($A$2:$A$11,SMALL(IF(ISNUMBER($C$2:$C$11),ROW($A$2:$A$11)-ROW($A$2)+1),ROWS(B$36:B42))))","v":{"$error":"#DIV/0!"}},{"$error":"#DIV/0!"},{"$error":"#DIV/0!"},{"$error":"#DIV/0!"},{"$error":"#DIV/0!"},{"$error":"#DIV/0!"},{"$error":"#DIV/0!"},{"$error":"#DIV/0!"},{"$error":"#DIV/0!"},{"$error":"#DIV/0!"},{"$error":"#DIV/0!"}]
[null,{"$f":"IF(ROWS(B$36:B43)>$D$22,1/0,INDEX($A$2:$A$11,SMALL(IF(ISNUMBER($C$2:$C$11),ROW($A$2:$A$11)-ROW($A$2)+1),ROWS(B$36:B43))))","v":{"$error":"#DIV/0!"}},{"$error":"#DIV/0!"},{"$error":"#DIV/0!"},{"$error":"#DIV/0!"},{"$error":"#DIV/0!"},{"$error":"#DIV/0!"},{"$error":"#DIV/0!"},{"$error":"#DIV/0!"},{"$error":"#DIV/0!"},{"$error":"#DIV/0!"},{"$error":"#DIV/0!"}]
[null,{"$f":"IF(ROWS(B$36:B44)>$D$22,1/0,INDEX($A$2:$A$11,SMALL(IF(ISNUMBER($C$2:$C$11),ROW($A$2:$A$11)-ROW($A$2)+1),ROWS(B$36:B44))))","v":{"$error":"#DIV/0!"}},{"$error":"#DIV/0!"},{"$error":"#DIV/0!"},{"$error":"#DIV/0!"},{"$error":"#DIV/0!"},{"$error":"#DIV/0!"},{"$error":"#DIV/0!"},{"$error":"#DIV/0!"},{"$error":"#DIV/0!"},{"$error":"#DIV/0!"},{"$error":"#DIV/0!"}]
[null,{"$f":"IF(ROWS(B$36:B45)>$D$22,1/0,INDEX($A$2:$A$11,SMALL(IF(ISNUMBER($C$2:$C$11),ROW($A$2:$A$11)-ROW($A$2)+1),ROWS(B$36:B45))))","v":{"$error":"#DIV/0!"}},{"$error":"#DIV/0!"},{"$error":"#DIV/0!"},{"$error":"#DIV/0!"},{"$error":"#DIV/0!"},{"$error":"#DIV/0!"},{"$error":"#DIV/0!"},{"$error":"#DIV/0!"},{"$error":"#DIV/0!"},{"$error":"#DIV/0!"},{"$error":"#DIV/0!"}]
[" "]
["Subject 3",{"$f":"IF(ROWS(B$47:B47)>$E$22,1/0,INDEX($A$2:$A$11,SMALL(IF(ISNUMBER($D$2:$D$11),ROW($A$2:$A$11)-ROW($A$2)+1),ROWS(B$47:B47))))","v":"Series 1"},{"$f":"IF($B47<>C$24,\"\",IF(ISNUMBER(INDEX($B$2:$D$11,MATCH($B47,$A$2:$A$11,0),MATCH($A$47,$B$1:$D$1,0))),INDEX($B$2:$D$11,MATCH($B47,$A$2:$A$11,0),MATCH($A$47,$B$1:$D$1,0)),\"Error\"))","v":1},{"$f":"IF($B47<>D$24,\"\",IF(ISNUMBER(INDEX($B$2:$D$11,MATCH($B47,$A$2:$A$11,0),MATCH($A$47,$B$1:$D$1,0))),INDEX($B$2:$D$11,MATCH($B47,$A$2:$A$11,0),MATCH($A$47,$B$1:$D$1,0)),\"Error\"))","v":""},"","","","","","","",""]
[null,{"$f":"IF(ROWS(B$47:B48)>$E$22,1/0,INDEX($A$2:$A$11,SMALL(IF(ISNUMBER($D$2:$D$11),ROW($A$2:$A$11)-ROW($A$2)+1),ROWS(B$47:B48))))","v":"Series 2"},{"$f":"IF($B48<>C$24,\"\",IF(ISNUMBER(INDEX($B$2:$D$11,MATCH($B48,$A$2:$A$11,0),MATCH($A$47,$B$1:$D$1,0))),INDEX($B$2:$D$11,MATCH($B48,$A$2:$A$11,0),MATCH($A$47,$B$1:$D$1,0)),\"Error\"))","v":""},1,"","","","","","","",""]
[null,{"$f":"IF(ROWS(B$47:B49)>$E$22,1/0,INDEX($A$2:$A$11,SMALL(IF(ISNUMBER($D$2:$D$11),ROW($A$2:$A$11)-ROW($A$2)+1),ROWS(B$47:B49))))","v":"Series 3"},"","",1,"","","","","","",""]
[null,{"$f":"IF(ROWS(B$47:B50)>$E$22,1/0,INDEX($A$2:$A$11,SMALL(IF(ISNUMBER($D$2:$D$11),ROW($A$2:$A$11)-ROW($A$2)+1),ROWS(B$47:B50))))","v":"Series 4"},"","","",9,"","","","","",""]
[null,{"$f":"IF(ROWS(B$47:B51)>$E$22,1/0,INDEX($A$2:$A$11,SMALL(IF(ISNUMBER($D$2:$D$11),ROW($A$2:$A$11)-ROW($A$2)+1),ROWS(B$47:B51))))","v":"Series 5"},"","","","",3,"","","","",""]
[null,{"$f":"IF(ROWS(B$47:B52)>$E$22,1/0,INDEX($A$2:$A$11,SMALL(IF(ISNUMBER($D$2:$D$11),ROW($A$2:$A$11)-ROW($A$2)+1),ROWS(B$47:B52))))","v":"Series 6"},"","","","","",3,"","","",""]
[null,{"$f":"IF(ROWS(B$47:B53)>$E$22,1/0,INDEX($A$2:$A$11,SMALL(IF(ISNUMBER($D$2:$D$11),ROW($A$2:$A$11)-ROW($A$2)+1),ROWS(B$47:B53))))","v":"Series 7"},"","","","","","",2,"","",""]
[null,{"$f":"IF(ROWS(B$47:B54)>$E$22,1/0,INDEX($A$2:$A$11,SMALL(IF(ISNUMBER($D$2:$D$11),ROW($A$2:$A$11)-ROW($A$2)+1),ROWS(B$47:B54))))","v":"Series 8"},"","","","","","","",6,"",""]
[null,{"$f":"IF(ROWS(B$47:B55)>$E$22,1/0,INDEX($A$2:$A$11,SMALL(IF(ISNUMBER($D$2:$D$11),ROW($A$2:$A$11)-ROW($A$2)+1),ROWS(B$47:B55))))","v":"Series 9"},"","","","","","","","",4,""]
[null,{"$f":"IF(ROWS(B$47:B56)>$E$22,1/0,INDEX($A$2:$A$11,SMALL(IF(ISNUMBER($D$2:$D$11),ROW($A$2:$A$11)-ROW($A$2)+1),ROWS(B$47:B56))))","v":"Series 10"},"","","","","","","","","",5]

{"sheet":"Sheet2","index":1,"n_rows":0,"n_cols":0,"rows_kept":0,"cut":false,"hidden":false,"merged":[]}

{"sheet":"Sheet3","index":2,"n_rows":0,"n_cols":0,"rows_kept":0,"cut":false,"hidden":false,"merged":[]}